Gross primary production
narrower: Peatland gross primary production
type: Concept
type: Variable

Peatland gross primary production
type: Concept
type: Variable
definition: Gross primary production (GPP) is the total amount of carbon dioxide "fixed" by land plants per unit time through the photosynthetic reduction of CO2 into organic compounds.
is in scheme: ozcar-theia
broader: Gross primary production
created: 2022-02-07T17:00:00
modified: 2022-02-08T12:20:55
has ObjectOfInterest: Carbon dioxide
has Property: Molar flux
has ContextObject: Primary production
has Matrix: Peatland
Simplified label: Gross primary production

type
comment: The subject is an instance of a class.

Concept
type: Class
label: SKOS Concept

Variable
type: Class

definition
definition: A statement or formal explanation of the meaning of a concept.
sub property of: note

Gross primary production (GPP) is the total amount of carbon dioxide "fixed" by land plants per unit time through the photosynthetic reduction of CO2 into organic compounds.
source: terrestrial-primary-production-fuel-for-life-17567411

is in scheme
definition: Relates a resource (for example a concept) to a concept scheme in which it is included.

preferred label
comment: A resource has no more than one value of skos:prefLabel per language tag, and no more than one value of skos:prefLabel without language tag.
comment: The range of skos:prefLabel is the class of RDF plain literals.
comment: skos:prefLabel, skos:altLabel and skos:hiddenLabel are pairwise disjoint properties.
definition: The preferred lexical label for a resource, in a given language.
sub property of: label

has broader
comment: Broader concepts are typically rendered as parents in a concept hierarchy (tree).
definition: Relates a concept to a concept that is more general in meaning.
sub property of: broaderTransitive

has ObjectOfInterest
comment: A Variable has an Entity whose Property is observed.

Carbon dioxide
type: Concept
type: Entity

has Property
comment: A Variable has a Property that characterizes an Entity.

Molar flux
type: Concept
type: Property

has ContextObject
comment: A Variable has an Entity that provides additional background information regarding the ObjectOfInterest.

Primary production
type: Concept
type: Entity

has Matrix
comment: A Variable might have an Entity in which the ObjectOfInterest is contained.
sub property of: has ContextObject

Peatland
type: Concept
type: Entity

Simplified label
comment: For Theia OZCAR information system purpose. This label is used to enhance discoverability on the information system.